Target
Growth factor receptor-bound protein 2
Ligand
BDBM50080831
Substrate
Meas. Tech.
ChEMBL_72487 (CHEMBL685520)
Kd
30±n/a nM
Citation
 Liu, WQVidal, MGresh, NRoques, BPGarbay, C Small peptides containing phosphotyrosine and adjacent alphaMe-phosphotyrosine or its mimetics as highly potent inhibitors of Grb2 SH2 domain. J Med Chem 42:3737-41 (1999)  
Target
Name:
Growth factor receptor-bound protein 2
Synonyms:
ASH GRB2 adapter protein Grb2-SH2 | Growth factor receptor-bound protein 2
Type:
Protein
Mol. Mass.:
25205.04
Organism:
Homo sapiens (Human)
Description:
P62993
Residue:
217
  
Inhibitor
Name:
BDBM50080831
Synonyms:
CHEMBL434413 | [1-[1-(1,2-Dicarbamoyl-ethylcarbamoyl)-cyclohexylcarbamoyl]-2-(4-phosphonooxy-phenyl)-ethyl]-carbamic acid 3-amino-benzyl ester
Type:
Small organic molecule
Emp. Form.:
C28H37N6O10P
Mol. Mass.:
648.6013
SMILES:
NC(=O)CC(NC(=O)C1(CCCCC1)NC(=O)C(Cc1ccc(OP(O)(O)=O)cc1)NC(=O)OCc1cccc(N)c1)C(N)=O
: