Target
Reverse transcriptase/RNaseH
Ligand
BDBM50082061
Substrate
Meas. Tech.
ChEMBL_196180 (CHEMBL804953)
Ki
11±n/a nM
Citation
 Campiani, GMorelli, EFabbrini, MNacci, VGreco, GNovellino, ERamunno, AMaga, GSpadari, SCaliendo, GBergamini, AFaggioli, EUccella, IBolacchi, FMarini, SColetta, MNacca, ACaccia, S Pyrrolobenzoxazepinone derivatives as non-nucleoside HIV-1 RT inhibitors: further structure-activity relationship studies and identification of more potent broad-spectrum HIV-1 RT inhibitors with antiviral activity. J Med Chem 42:4462-70 (1999)  
Target
Name:
Reverse transcriptase/RNaseH
Synonyms:
HIV-1 Reverse Transcriptase RNase H Reverse transcriptase/RNaseH
Type:
PROTEIN
Mol. Mass.:
65229.15
Organism:
Human immunodeficiency virus 1
Description:
ChEMBL_1473730
Residue:
566
  
Inhibitor
Name:
BDBM50082061
Synonyms:
(+/-)-5-ethyl-5-(3-methoxy-phenyl)-6-oxa-10b-aza-benzo[e]azulen-4-one 6-ethyl-6-(3-methoxyphenyl)benzo[b]pyrrolo[1,2-d][1,4]oxazepin-7(6H)-one | CHEMBL140665
Type:
Small organic molecule
Emp. Form.:
C21H19NO3
Mol. Mass.:
333.3805
SMILES:
CCC1(Oc2ccccc2-n2cccc2C1=O)c1cccc(OC)c1
: