Target
Similar to alpha-tubulin isoform 1
Ligand
BDBM50528639
Substrate
Meas. Tech.
ChEMBL_1905929 (CHEMBL4408287)
IC50
520±n/a nM
Citation
 Romagnoli, ROliva, PSalvador, MKCamacho, MEPadroni, CBrancale, AFerla, SHamel, ERonca, RGrillo, EBortolozzi, RRruga, FMariotto, EViola, G Design, synthesis and biological evaluation of novel vicinal diaryl-substituted 1H-Pyrazole analogues of combretastatin A-4 as highly potent tubulin polymerization inhibitors. Eur J Med Chem 181:0 (2019)  
Target
Name:
Similar to alpha-tubulin isoform 1
Synonyms:
Similar to alpha-tubulin isoform 1
Type:
PROTEIN
Mol. Mass.:
10383.05
Organism:
Bos taurus
Description:
ChEMBL_104716
Residue:
99
  
Inhibitor
Name:
BDBM50528639
Synonyms:
CHEMBL4525021
Type:
Small organic molecule
Emp. Form.:
C20H22N2O3
Mol. Mass.:
338.4003
SMILES:
CCc1ccc(cc1)-c1c[nH]nc1-c1cc(OC)c(OC)c(OC)c1
: