Target
Similar to alpha-tubulin isoform 1
Ligand
BDBM50215153
Substrate
Meas. Tech.
ChEMBL_1905955 (CHEMBL4408313)
IC50
3000±n/a nM
Citation
 Romagnoli, ROliva, PSalvador, MKCamacho, MEPadroni, CBrancale, AFerla, SHamel, ERonca, RGrillo, EBortolozzi, RRruga, FMariotto, EViola, G Design, synthesis and biological evaluation of novel vicinal diaryl-substituted 1H-Pyrazole analogues of combretastatin A-4 as highly potent tubulin polymerization inhibitors. Eur J Med Chem 181:0 (2019)  
Target
Name:
Similar to alpha-tubulin isoform 1
Synonyms:
Similar to alpha-tubulin isoform 1
Type:
PROTEIN
Mol. Mass.:
10383.05
Organism:
Bos taurus
Description:
ChEMBL_104716
Residue:
99
  
Inhibitor
Name:
BDBM50215153
Synonyms:
CHEMBL108621
Type:
Small organic molecule
Emp. Form.:
C19H21N3O4
Mol. Mass.:
355.3877
SMILES:
COc1ccc(cc1N)-c1c[nH]nc1-c1cc(OC)c(OC)c(OC)c1
: