Target
Similar to alpha-tubulin isoform 1
Ligand
BDBM50528643
Substrate
Meas. Tech.
ChEMBL_1905929 (CHEMBL4408287)
IC50
570±n/a nM
Citation
 Romagnoli, ROliva, PSalvador, MKCamacho, MEPadroni, CBrancale, AFerla, SHamel, ERonca, RGrillo, EBortolozzi, RRruga, FMariotto, EViola, G Design, synthesis and biological evaluation of novel vicinal diaryl-substituted 1H-Pyrazole analogues of combretastatin A-4 as highly potent tubulin polymerization inhibitors. Eur J Med Chem 181:0 (2019)  
Target
Name:
Similar to alpha-tubulin isoform 1
Synonyms:
Similar to alpha-tubulin isoform 1
Type:
PROTEIN
Mol. Mass.:
10383.05
Organism:
Bos taurus
Description:
ChEMBL_104716
Residue:
99
  
Inhibitor
Name:
BDBM50528643
Synonyms:
CHEMBL4533893
Type:
Small organic molecule
Emp. Form.:
C19H20N2O3S
Mol. Mass.:
356.439
SMILES:
COc1cc(cc(OC)c1OC)-c1n[nH]cc1-c1ccc(SC)cc1
: