Target
Delta-type opioid receptor
Ligand
BDBM50084133
Substrate
Meas. Tech.
ChEMBL_146766 (CHEMBL755210)
IC50
38±n/a nM
Citation
 Alfaro-Lopez, JOkayama, THosohata, KDavis, PPorreca, FYamamura, HIHruby, VJ Exploring the structure-activity relationships of [1-(4-tert-butyl-3'-hydroxy)benzhydryl-4-benzylpiperazine] (SL-3111), a high-affinity and selective delta-opioid receptor nonpeptide agonist ligand. J Med Chem 42:5359-68 (2000)  
Target
Name:
Delta-type opioid receptor
Synonyms:
Cytochrome P450 3A4 Delta opioid receptor Delta-type opioid receptor (DOR) OPRD_RAT Opioid receptor Opioid receptors; mu & delta Ror-a | Voltage-gated potassium channel
Type:
G Protein-Coupled Receptor (GPCR)
Mol. Mass.:
40465.04
Organism:
Rattus norvegicus (rat)
Description:
Competition binding assays were using CHO-K1 cell membranes expressing the opioid receptor.
Residue:
372
  
Inhibitor
Name:
BDBM50084133
Synonyms:
3-[((R)-4-Benzyl-2-benzyloxymethyl-piperazin-1-yl)-(4-tert-butyl-phenyl)-methyl]-phenol | CHEMBL357746
Type:
Small organic molecule
Emp. Form.:
C36H42N2O2
Mol. Mass.:
534.7309
SMILES:
CC(C)(C)c1ccc(cc1)C(N1CCN(Cc2ccccc2)C[C@@H]1COCc1ccccc1)c1cccc(O)c1
: