Target
5-hydroxytryptamine receptor 2A/2B/2C
Ligand
BDBM50088844
Substrate
Meas. Tech.
ChEMBL_2250 (CHEMBL617195)
Ki
37±n/a nM
Citation
 Hanano, TAdachi, KAoki, YMorimoto, HNaka, YHisadome, MFukuda, TSumichika, H Novel phenylpiperazine derivatives as dual cytokine regulators with TNF-alpha suppressing and IL-10 augmenting activity. Bioorg Med Chem Lett 10:875-9 (2000)  
Target
Name:
5-hydroxytryptamine receptor 2A/2B/2C
Synonyms:
Serotonin 2 (5-HT2) receptor
Type:
Mol. Mass.:
Description:
ASSAY_ID of ChEMBL is 306637
Components:
This complex has 3 components.
Component 1
Name:
5-hydroxytryptamine receptor 2B
Synonyms:
5-HT-2B 5-hydroxytryptamine (serotonin) receptor 2B [Homo sapiens] 5-hydroxytryptamine receptor 2C (5HT2C) HTR2B Serotonin 2b (5-HT2b) receptor | Serotonin Receptor 2B
Type:
G Protein-Coupled Receptor (GPCR)
Mol. Mass.:
54312.47
Organism:
Homo sapiens (Human)
Description:
Receptor binding assays were performed using human clone stably expressed in CHO cells.
Residue:
481
  
Component 2
Name:
5-hydroxytryptamine receptor 2C
Synonyms:
5-HT-2C 5-HT2C-INI 5-HTR2C 5-hydroxytryptamine receptor 2C (5-HT-2C) 5HT-1C HTR1C Serotonin (5-HT3) receptor Serotonin Receptor 2C
Type:
G Protein-Coupled Receptor (GPCR)
Mol. Mass.:
51836.79
Organism:
Homo sapiens (Human)
Description:
P28335
Residue:
458
  
Component 3
Name:
5-hydroxytryptamine receptor 2A
Synonyms:
5-HT-2 5-HT2A 5-hydroxytryptamine receptor 2A (5HT-2A) 5HT2A_HUMAN HTR2A | Serotonin receptor 2A
Type:
undefined
Mol. Mass.:
52607.65
Organism:
Homo sapiens (Human)
Description:
P28223
Residue:
471
  
Inhibitor
Name:
BDBM50088844
Synonyms:
4-{4-[4-(4-Phenyl-piperazin-1-yl)-butyl]-phenyl}-thiazol-2-ylamine | CHEMBL171316
Type:
Small organic molecule
Emp. Form.:
C23H28N4S
Mol. Mass.:
392.56
SMILES:
Nc1nc(cs1)-c1ccc(CCCCN2CCN(CC2)c2ccccc2)cc1
: