Target
Polyphenol oxidase 2
Ligand
BDBM50195793
Substrate
Meas. Tech.
ChEMBL_1925060 (CHEMBL4428016)
IC50
6970±n/a nM
Citation
 Oyama, TTakahashi, SYoshimori, AYamamoto, TSato, AKamiya, TAbe, HAbe, TTanuma, SI Discovery of a new type of scaffold for the creation of novel tyrosinase inhibitors. Bioorg Med Chem 24:4509-4515 (2016)  
Target
Name:
Polyphenol oxidase 2
Synonyms:
Monophenol monooxygenase PPO2 Tyrosinase
Type:
Protein
Mol. Mass.:
63923.66
Organism:
Agaricus bisporus (Common mushroom)
Description:
O42713
Residue:
556
  
Inhibitor
Name:
BDBM50195793
Synonyms:
CHEMBL123234
Type:
Small organic molecule
Emp. Form.:
C13H10O2
Mol. Mass.:
198.2173
SMILES:
OC(=O)c1cccc(c1)-c1ccccc1
: