Target
Presenilin-1
Ligand
BDBM50534365
Substrate
Meas. Tech.
ChEMBL_1928510 (CHEMBL4431686)
EC50
16±n/a nM
Citation
 Bursavich, MGHarrison, BABlain, JF Gamma Secretase Modulators: New Alzheimer's Drugs on the Horizon? J Med Chem 59:7389-409 (2016)  
Target
Name:
Presenilin-1
Synonyms:
3.4.23.- Gamma-Secretase Subunit Presenilin-1 PS1 PSEN1 PSNL1 Presenilin-1 CTF12 Protein S182
Type:
Mol. Mass.:
52657.13
Organism:
Homo sapiens (Human)
Description:
P49768
Residue:
467
  
Inhibitor
Name:
BDBM50534365
Synonyms:
CHEMBL4591885
Type:
Small organic molecule
Emp. Form.:
C24H24N6O2
Mol. Mass.:
428.4864
SMILES:
COc1cc(Nc2ncc3OC[C@@H](N(C)c3n2)c2ccccc2)ccc1-n1cnc(C)c1
: