Target
Presenilin-1
Ligand
BDBM50534367
Substrate
Meas. Tech.
ChEMBL_1928510 (CHEMBL4431686)
EC50
14±n/a nM
Citation
 Bursavich, MGHarrison, BABlain, JF Gamma Secretase Modulators: New Alzheimer's Drugs on the Horizon? J Med Chem 59:7389-409 (2016)  
Target
Name:
Presenilin-1
Synonyms:
3.4.23.- Gamma-Secretase Subunit Presenilin-1 PS1 PSEN1 PSNL1 Presenilin-1 CTF12 Protein S182
Type:
Mol. Mass.:
52657.13
Organism:
Homo sapiens (Human)
Description:
P49768
Residue:
467
  
Inhibitor
Name:
BDBM50534367
Synonyms:
CHEMBL4470238
Type:
Small organic molecule
Emp. Form.:
C23H20F2N6O2
Mol. Mass.:
450.4407
SMILES:
COc1cc(Nc2ncc3OCCN(c4cc(F)cc(F)c4)c3n2)ccc1-n1cnc(C)c1
: