Target
Steroid 17-alpha-hydroxylase/17,20 lyase
Ligand
BDBM50093602
Substrate
Meas. Tech.
ChEMBL_50372 (CHEMBL661715)
IC50
40±n/a nM
Citation
 Hartmann, RWHector, MWachall, BGPalusczak, APalzer, MHuch, VVeith, M Synthesis and evaluation of 17-aliphatic heterocycle-substituted steroidal inhibitors of 17alpha-hydroxylase/C17-20-lyase (P450 17). J Med Chem 43:4437-45 (2000)  
Target
Name:
Steroid 17-alpha-hydroxylase/17,20 lyase
Synonyms:
CP17A_RAT Cyp17a1 Cytochrome P450 17A1 Steroid 17-alpha-hydroxylase/17,20 lyase
Type:
Enzyme
Mol. Mass.:
57255.68
Organism:
Rattus norvegicus (Rat)
Description:
P11715
Residue:
507
  
Inhibitor
Name:
BDBM50093602
Synonyms:
17-(1H-Imidazol-4-yl)-10,13-dimethyl-2,3,4,7,8,9,10,11,12,13,14,15-dodecahydro-1H-cyclopenta[a]phenanthren-3-ol | CHEMBL134644
Type:
Small organic molecule
Emp. Form.:
C22H30N2O
Mol. Mass.:
338.4864
SMILES:
CC12CCC3C(CC=C4CC(O)CCC34C)C1CC=C2c1cnc[nH]1
: