Target
Bromodomain-containing protein 1
Ligand
BDBM50539801
Substrate
Meas. Tech.
ChEMBL_1979361 (CHEMBL4612496)
Kd
<1.000000±n/a nM
Citation
 Li, YZhao, JGutgesell, LMShen, ZRatia, KDye, KDubrovskyi, OZhao, HHuang, FTonetti, DAThatcher, GRJXiong, R Novel Pyrrolopyridone Bromodomain and Extra-Terminal Motif (BET) Inhibitors Effective in Endocrine-Resistant ER+ Breast Cancer with Acquired Resistance to Fulvestrant and Palbociclib. J Med Chem 63:7186-7210 (2020)  
Target
Name:
Bromodomain-containing protein 1
Synonyms:
BR140-like protein BRD1_HUMAN BRL Bromodomain and PHD finger-containing protein 2 | Bromodomain-containing protein 1
Type:
PROTEIN
Mol. Mass.:
119557.65
Organism:
Homo sapiens (Human)
Description:
ChEMBL_105349
Residue:
1058
  
Inhibitor
Name:
BDBM50539801
Synonyms:
CHEMBL4648912 | US11840533, Compound 70
Type:
Small organic molecule
Emp. Form.:
C30H28N6O3S
Mol. Mass.:
552.647
SMILES:
CCS(=O)(=O)Nc1cc(cc2n(ccc12)C(C)(c1ccccn1)c1ccccn1)-c1cn(C)c2c1cc[nH]c2=O
: