Target
Telomerase reverse transcriptase
Ligand
BDBM50104497
Substrate
Meas. Tech.
ChEBML_210074
IC50
22900±n/a nM
Citation
 Sasaki, SEhara, TAlam, MRFujino, YHarada, NKimura, JNakamura, HMaeda, M Solid-Phase synthesis of a library constructed of aromatic phosphate, long alkyl chains and tryptophane components, and identification of potent dipeptide telomerase inhibitors. Bioorg Med Chem Lett 11:2581-4 (2001)  
Target
Name:
Telomerase reverse transcriptase
Synonyms:
EST2 TERT TRT
Type:
PROTEIN
Mol. Mass.:
127099.03
Organism:
Homo sapiens (Human)
Description:
ChEMBL_1447029
Residue:
1132
  
Inhibitor
Name:
BDBM50104497
Synonyms:
CHEMBL87116 | Phosphoric acid 12-[(R)-2-[(R)-2-acetylamino-3-(1H-indol-2-yl)-propionylamino]-3-(1H-indol-3-yl)-propionylamino]-dodecyl ester 2-chloro-phenyl ester; compound with triethyl-amine
Type:
Small organic molecule
Emp. Form.:
C42H53ClN5O7P
Mol. Mass.:
806.326
SMILES:
CC(=O)N[C@H](Cc1cc2ccccc2[nH]1)C(=O)N[C@H](Cc1c[nH]c2ccccc12)C(=O)NCCCCCCCCCCCCOP(O)(=O)Oc1ccccc1Cl
: