Target
Signal peptide peptidase-like 2B
Ligand
BDBM50546132
Substrate
Meas. Tech.
ChEMBL_2014332 (CHEMBL4667910)
IC50
270±n/a nM
Citation
 Velcicky, JMathison, CJNNikulin, VPflieger, DEpple, RAzimioara, MCow, CMichellys, PYRigollier, PBeisner, DRBodendorf, UGuerini, DLiu, BWen, BZaharevitz, SBrandl, T Discovery of Orally Active Hydroxyethylamine Based SPPL2a Inhibitors. ACS Med Chem Lett 10:887-892 (2019)  
Target
Name:
Signal peptide peptidase-like 2B
Synonyms:
3.4.23.- IMP4 KIAA1532 PSL1 Presenilin-like protein 1 SPP2B_HUMAN Signal peptide peptidase-like 2B | Synonyms=IMP4
Type:
PROTEIN
Mol. Mass.:
64655.18
Organism:
Homo sapiens
Description:
ChEMBL_117517
Residue:
592
  
Inhibitor
Name:
BDBM50546132
Synonyms:
CHEMBL4759048
Type:
Small organic molecule
Emp. Form.:
C24H31F3N2O4S
Mol. Mass.:
500.574
SMILES:
CC(C)(C)c1ccc(cc1)S(=O)(=O)N(C[C@H](O)[C@@H](N)c1ccc(OC(F)(F)F)cc1)C1CCC1
: