Target
Tubulin beta-2B chain
Ligand
BDBM50107673
Substrate
Meas. Tech.
ChEMBL_211336 (CHEMBL820779)
IC50
2100±n/a nM
Citation
 Mahboobi, SPongratz, HHufsky, HHockemeyer, JFrieser, MLyssenko, APaper, DHBürgermeister, JBöhmer, FDFiebig, HHBurger, AMBaasner, SBeckers, T Synthetic 2-aroylindole derivatives as a new class of potent tubulin-inhibitory, antimitotic agents. J Med Chem 44:4535-53 (2001)  
Target
Name:
Tubulin beta-2B chain
Synonyms:
TBB2B_BOVIN Tubulin | Tubulin beta chain
Type:
PROTEIN
Mol. Mass.:
49932.38
Organism:
Bos taurus
Description:
ChEMBL_211651
Residue:
445
  
Inhibitor
Name:
BDBM50107673
Synonyms:
(3-Difluoromethylsulfanyl-phenyl)-(5-methoxy-1H-indol-2-yl)-methanone | CHEMBL140873
Type:
Small organic molecule
Emp. Form.:
C17H13F2NO2S
Mol. Mass.:
333.352
SMILES:
COc1ccc2[nH]c(cc2c1)C(=O)c1cccc(SC(F)F)c1
: