Target
Fatty acid CoA ligase Acsl3
Ligand
BDBM50549457
Substrate
Meas. Tech.
ChEMBL_2024884 (CHEMBL4678697)
IC50
69000±n/a nM
Citation
 Hayashi, KKondo, NOmori, NYoshimoto, RHato, MShigaki, SNagasawa, AIto, MOkuno, T Discovery of a benzimidazole series as the first highly potent and selective ACSL1 inhibitors. Bioorg Med Chem Lett 33:0 (2021)  
Target
Name:
Fatty acid CoA ligase Acsl3
Synonyms:
6.2.1.15 6.2.1.3 ACSL3 Arachidonate--CoA ligase Fatty acid CoA ligase Acsl3 LACS3 Long-chain-fatty-acid--CoA ligase 3 | Medium-chain acyl-CoA ligase Acsl3
Type:
PROTEIN
Mol. Mass.:
80435.82
Organism:
Homo sapiens
Description:
ChEMBL_120091
Residue:
720
  
Inhibitor
Name:
BDBM50549457
Synonyms:
CHEMBL4761388
Type:
Small organic molecule
Emp. Form.:
C20H18O5
Mol. Mass.:
338.3539
SMILES:
OC(=O)[C@@H]1CC[C@@H](CC1)Oc1ccc2oc3ccccc3c(=O)c2c1
: