Target
Fatty acid CoA ligase Acsl3
Ligand
BDBM50156764
Substrate
Meas. Tech.
ChEMBL_2024884 (CHEMBL4678697)
IC50
>200000±n/a nM
Citation
 Hayashi, KKondo, NOmori, NYoshimoto, RHato, MShigaki, SNagasawa, AIto, MOkuno, T Discovery of a benzimidazole series as the first highly potent and selective ACSL1 inhibitors. Bioorg Med Chem Lett 33:0 (2021)  
Target
Name:
Fatty acid CoA ligase Acsl3
Synonyms:
6.2.1.15 6.2.1.3 ACSL3 Arachidonate--CoA ligase Fatty acid CoA ligase Acsl3 LACS3 Long-chain-fatty-acid--CoA ligase 3 | Medium-chain acyl-CoA ligase Acsl3
Type:
PROTEIN
Mol. Mass.:
80435.82
Organism:
Homo sapiens
Description:
ChEMBL_120091
Residue:
720
  
Inhibitor
Name:
BDBM50156764
Synonyms:
5-(9-oxo-9H-xanthen-2-yloxy)pentanoic acid | CHEMBL222502
Type:
Small organic molecule
Emp. Form.:
C18H16O5
Mol. Mass.:
312.3166
SMILES:
OC(=O)CCCCOc1ccc2oc3ccccc3c(=O)c2c1
: