Target
Furin
Ligand
BDBM50552677
Substrate
Meas. Tech.
ChEMBL_2035313 (CHEMBL4689471)
Ki
0.077±n/a nM
Citation
 Lam van, TVHeindl, MRSchlutt, CBöttcher-Friebertshäuser, EBartenschlager, RKlebe, GBrandstetter, HDahms, SOSteinmetzer, T The Basicity Makes the Difference: Improved Canavanine-Derived Inhibitors of the Proprotein Convertase Furin. ACS Med Chem Lett 12:426-432 (2021)  
Target
Name:
Furin
Synonyms:
FUR FURIN_HUMAN PACE | PCSK3
Type:
Enzyme Catalytic Domain
Mol. Mass.:
86676.01
Organism:
Homo sapiens (Human)
Description:
P09958
Residue:
794
  
Inhibitor
Name:
BDBM50552677
Synonyms:
CHEMBL4779067
Type:
Small organic molecule
Emp. Form.:
C34H53N13O5
Mol. Mass.:
723.8687
SMILES:
CC(C)(C)[C@H](NC(=O)[C@H](CCCNC(N)=N)NC(=O)Cc1ccc(CN)cc1)C(=O)N[C@@H](CCONC(N)=N)C(=O)NCc1ccc(cc1)C(N)=N
: