Target
Furin
Ligand
BDBM50552679
Substrate
Meas. Tech.
ChEMBL_2035313 (CHEMBL4689471)
Ki
0.009±n/a nM
Citation
 Lam van, TVHeindl, MRSchlutt, CBöttcher-Friebertshäuser, EBartenschlager, RKlebe, GBrandstetter, HDahms, SOSteinmetzer, T The Basicity Makes the Difference: Improved Canavanine-Derived Inhibitors of the Proprotein Convertase Furin. ACS Med Chem Lett 12:426-432 (2021)  
Target
Name:
Furin
Synonyms:
FUR FURIN_HUMAN PACE | PCSK3
Type:
Enzyme Catalytic Domain
Mol. Mass.:
86676.01
Organism:
Homo sapiens (Human)
Description:
P09958
Residue:
794
  
Inhibitor
Name:
BDBM50552679
Synonyms:
CHEMBL4762678
Type:
Small organic molecule
Emp. Form.:
C36H57N13O4
Mol. Mass.:
735.9225
SMILES:
CC(C)(C)[C@H](NC(=O)[C@H](CCCNC(N)=N)NC(=O)Cc1ccc(CNC(N)=N)cc1)C(=O)N[C@@H](CCCCN)C(=O)NCc1ccc(cc1)C(N)=N
: