Target
GABA-A receptor; alpha-5/beta-3/gamma-2
Ligand
BDBM50553734
Substrate
Meas. Tech.
ChEMBL_2047123 (CHEMBL4701822)
Ki
76±n/a nM
Citation
 Lewis, ABeresford, AChambers, MSClark, GHartley, DCHirst, KLHigashino, MKawahadara, SNakanishi, MSaito, TImagawa, AHabashita, HMaidment, SMacleod, AMOwens, APRae, ARouse, CWishart, G Discovery of ONO-8590580: A novel, potent and selective GABA Bioorg Med Chem Lett 30:0 (2020)  
Target
Name:
GABA-A receptor; alpha-5/beta-3/gamma-2
Synonyms:
GABA receptor alpha-5/beta-3/gamma-2 subunit | Gamma-aminobutyric acid receptor subunit alpha-5/beta-3/gamma-2
Type:
Mol. Mass.:
Description:
ASSAY_ID of ChEMBL is 2148177
Components:
This complex has 3 components.
Component 1
Name:
Gamma-aminobutyric acid receptor subunit gamma-2
Synonyms:
GABA(A) receptor subunit gamma-2 GBRG2_HUMAN
Type:
PROTEIN
Mol. Mass.:
54172.74
Organism:
Homo sapiens (Human)
Description:
EBI_217
Residue:
467
  
Component 2
Name:
Gamma-aminobutyric acid receptor subunit beta-3
Synonyms:
GABA A receptor alpha-4/beta-3/gamma-2 GABA-A receptor GBRB3_HUMAN | agonist GABA site
Type:
PROTEIN
Mol. Mass.:
54130.51
Organism:
Homo sapiens (Human)
Description:
ChEMBL_448071
Residue:
473
  
Component 3
Name:
Gamma-aminobutyric acid receptor subunit alpha-5
Synonyms:
GABA receptor alpha-5 subunit GABRA5 Gamma-aminobutyric acid receptor subunit alpha-5 (GABA(A)) | Gamma-aminobutyric acid receptor subunit alpha-5 (GABAA)
Type:
Enzyme
Mol. Mass.:
52160.59
Organism:
Homo sapiens (Human)
Description:
P31644
Residue:
462
  
Inhibitor
Name:
BDBM50553734
Synonyms:
CHEMBL4778552
Type:
Small organic molecule
Emp. Form.:
C18H20N4O2
Mol. Mass.:
324.377
SMILES:
COc1ccc(Nc2cc3n(CC4CC4)cnc3cn2)c(OC)c1
: