Target
Adenosine receptor A2a
Ligand
BDBM50120757
Substrate
Meas. Tech.
ChEMBL_30745 (CHEMBL649776)
Ki
682.0±n/a nM
Citation
 Novellino, EAbignente, ECosimelli, BGreco, GIadanza, MLaneri, SLavecchia, ARimoli, MGSettimo, FDPrimofiore, GTuscano, DTrincavelli, LMartini, C Design, synthesis and biological evaluation of novel N-alkyl- and N-acyl-(7-substituted-2-phenylimidazo[1,2-a][1,3,5]triazin-4-yl)amines (ITAs) as novel A(1) adenosine receptor antagonists. J Med Chem 45:5030-6 (2002)  
Target
Name:
Adenosine receptor A2a
Synonyms:
A2A adenosine receptor (hA2A) ADENOSINE A2 ADORA2 Adenosine A2A receptor (A2AAR)
Type:
G Protein-Coupled Receptor (GPCR)
Mol. Mass.:
44716.46
Organism:
Homo sapiens (Human)
Description:
P29274
Residue:
412
  
Inhibitor
Name:
BDBM50120757
Synonyms:
7-Methyl-2-phenyl-imidazo[1,2-a][1,3,5]triazin-4-ylamine | CHEMBL358341
Type:
Small organic molecule
Emp. Form.:
C12H11N5
Mol. Mass.:
225.2492
SMILES:
Cc1cn2c(N)nc(nc2n1)-c1ccccc1
: