Target
Adenosine receptor A2a
Ligand
BDBM50120764
Substrate
Meas. Tech.
ChEMBL_30745 (CHEMBL649776)
Ki
2500±n/a nM
Citation
 Novellino, EAbignente, ECosimelli, BGreco, GIadanza, MLaneri, SLavecchia, ARimoli, MGSettimo, FDPrimofiore, GTuscano, DTrincavelli, LMartini, C Design, synthesis and biological evaluation of novel N-alkyl- and N-acyl-(7-substituted-2-phenylimidazo[1,2-a][1,3,5]triazin-4-yl)amines (ITAs) as novel A(1) adenosine receptor antagonists. J Med Chem 45:5030-6 (2002)  
Target
Name:
Adenosine receptor A2a
Synonyms:
A2A adenosine receptor (hA2A) ADENOSINE A2 ADORA2 Adenosine A2A receptor (A2AAR)
Type:
G Protein-Coupled Receptor (GPCR)
Mol. Mass.:
44716.46
Organism:
Homo sapiens (Human)
Description:
P29274
Residue:
412
  
Inhibitor
Name:
BDBM50120764
Synonyms:
CHEMBL149732 | Cyclopentanecarboxylic acid (2,7-diphenyl-imidazo[1,2-a][1,3,5]triazin-4-yl)-amide
Type:
Small organic molecule
Emp. Form.:
C23H21N5O
Mol. Mass.:
383.4457
SMILES:
O=C(Nc1nc(nc2nc(cn12)-c1ccccc1)-c1ccccc1)C1CCCC1
: