Target
Progesterone receptor
Ligand
BDBM50121172
Substrate
Meas. Tech.
ChEBML_159532
IC50
20±n/a nM
Citation
 Fensome, ABender, RCohen, JCollins, MAMackner, VAMiller, LLUllrich, JWWinneker, RWrobel, JZhang, PZhang, ZZhu, Y New progesterone receptor antagonists: 3,3-disubstituted-5-aryloxindoles. Bioorg Med Chem Lett 12:3487-90 (2002)  
Target
Name:
Progesterone receptor
Synonyms:
NR3C3 PGR PRGR_HUMAN | progesterone
Type:
Protein
Mol. Mass.:
98979.52
Organism:
Homo sapiens (Human)
Description:
P06401
Residue:
933
  
Inhibitor
Name:
BDBM50121172
Synonyms:
5-fluoro-3-(2'-oxo-1',2'-dihydrospiro[cyclohexane-1,3'-indol]-5'-yl)benzonitrile | CHEMBL333484
Type:
Small organic molecule
Emp. Form.:
C20H17FN2O
Mol. Mass.:
320.3602
SMILES:
Fc1cc(cc(c1)-c1ccc2NC(=O)C3(CCCCC3)c2c1)C#N
: