Target
Progesterone receptor
Ligand
BDBM50121157
Substrate
Meas. Tech.
ChEBML_159532
IC50
27±n/a nM
Citation
 Fensome, ABender, RCohen, JCollins, MAMackner, VAMiller, LLUllrich, JWWinneker, RWrobel, JZhang, PZhang, ZZhu, Y New progesterone receptor antagonists: 3,3-disubstituted-5-aryloxindoles. Bioorg Med Chem Lett 12:3487-90 (2002)  
Target
Name:
Progesterone receptor
Synonyms:
NR3C3 PGR PRGR_HUMAN | progesterone
Type:
Protein
Mol. Mass.:
98979.52
Organism:
Homo sapiens (Human)
Description:
P06401
Residue:
933
  
Inhibitor
Name:
BDBM50121157
Synonyms:
5-(3-Fluoro-5-nitro-phenyl)-3,3-dimethyl-1,3-dihydro-indol-2-one | CHEMBL115638
Type:
Small organic molecule
Emp. Form.:
C16H13FN2O3
Mol. Mass.:
300.2844
SMILES:
CC1(C)C(=O)Nc2ccc(cc12)-c1cc(F)cc(c1)[N+]([O-])=O
: