Target
Progesterone receptor
Ligand
BDBM50121159
Substrate
Meas. Tech.
ChEBML_159532
IC50
185±n/a nM
Citation
 Fensome, ABender, RCohen, JCollins, MAMackner, VAMiller, LLUllrich, JWWinneker, RWrobel, JZhang, PZhang, ZZhu, Y New progesterone receptor antagonists: 3,3-disubstituted-5-aryloxindoles. Bioorg Med Chem Lett 12:3487-90 (2002)  
Target
Name:
Progesterone receptor
Synonyms:
NR3C3 PGR PRGR_HUMAN | progesterone
Type:
Protein
Mol. Mass.:
98979.52
Organism:
Homo sapiens (Human)
Description:
P06401
Residue:
933
  
Inhibitor
Name:
BDBM50121159
Synonyms:
5-(3-Chloro-phenyl)-3-methyl-1,3-dihydro-indol-2-one | CHEMBL324156
Type:
Small organic molecule
Emp. Form.:
C15H12ClNO
Mol. Mass.:
257.715
SMILES:
CC1C(=O)Nc2ccc(cc12)-c1cccc(Cl)c1
: