Target
Progesterone receptor
Ligand
BDBM50121162
Substrate
Meas. Tech.
ChEBML_159532
IC50
85±n/a nM
Citation
 Fensome, ABender, RCohen, JCollins, MAMackner, VAMiller, LLUllrich, JWWinneker, RWrobel, JZhang, PZhang, ZZhu, Y New progesterone receptor antagonists: 3,3-disubstituted-5-aryloxindoles. Bioorg Med Chem Lett 12:3487-90 (2002)  
Target
Name:
Progesterone receptor
Synonyms:
NR3C3 PGR PRGR_HUMAN | progesterone
Type:
Protein
Mol. Mass.:
98979.52
Organism:
Homo sapiens (Human)
Description:
P06401
Residue:
933
  
Inhibitor
Name:
BDBM50121162
Synonyms:
5'-(3-chlorophenyl)spiro[cyclopropane-1,3'-indol]-2'(1'H)-one | CHEMBL331249
Type:
Small organic molecule
Emp. Form.:
C16H12ClNO
Mol. Mass.:
269.726
SMILES:
Clc1cccc(c1)-c1ccc2NC(=O)C3(CC3)c2c1
: