Target
Progesterone receptor
Ligand
BDBM50121168
Substrate
Meas. Tech.
ChEMBL_159533 (CHEMBL767566)
IC50
31±n/a nM
Citation
 Fensome, ABender, RCohen, JCollins, MAMackner, VAMiller, LLUllrich, JWWinneker, RWrobel, JZhang, PZhang, ZZhu, Y New progesterone receptor antagonists: 3,3-disubstituted-5-aryloxindoles. Bioorg Med Chem Lett 12:3487-90 (2002)  
Target
Name:
Progesterone receptor
Synonyms:
NR3C3 PGR PRGR_HUMAN | progesterone
Type:
Protein
Mol. Mass.:
98979.52
Organism:
Homo sapiens (Human)
Description:
P06401
Residue:
933
  
Inhibitor
Name:
BDBM50121168
Synonyms:
3,3-Dimethyl-5-(3-nitro-phenyl)-1,3-dihydro-indol-2-one | CHEMBL119058
Type:
Small organic molecule
Emp. Form.:
C16H14N2O3
Mol. Mass.:
282.294
SMILES:
CC1(C)C(=O)Nc2ccc(cc12)-c1cccc(c1)[N+]([O-])=O
: