Target
Progesterone receptor
Ligand
BDBM50121166
Substrate
Meas. Tech.
ChEMBL_159533 (CHEMBL767566)
IC50
38±n/a nM
Citation
 Fensome, ABender, RCohen, JCollins, MAMackner, VAMiller, LLUllrich, JWWinneker, RWrobel, JZhang, PZhang, ZZhu, Y New progesterone receptor antagonists: 3,3-disubstituted-5-aryloxindoles. Bioorg Med Chem Lett 12:3487-90 (2002)  
Target
Name:
Progesterone receptor
Synonyms:
NR3C3 PGR PRGR_HUMAN | progesterone
Type:
Protein
Mol. Mass.:
98979.52
Organism:
Homo sapiens (Human)
Description:
P06401
Residue:
933
  
Inhibitor
Name:
BDBM50121166
Synonyms:
5'-(3-nitrophenyl)spiro[cyclopentane-1,3'-indol]-2'(1'H)-one | CHEMBL419057
Type:
Small organic molecule
Emp. Form.:
C18H16N2O3
Mol. Mass.:
308.3312
SMILES:
[O-][N+](=O)c1cccc(c1)-c1ccc2NC(=O)C3(CCCC3)c2c1
: