Target
Progesterone receptor
Ligand
BDBM50121176
Substrate
Meas. Tech.
ChEBML_159532
IC50
21±n/a nM
Citation
 Fensome, ABender, RCohen, JCollins, MAMackner, VAMiller, LLUllrich, JWWinneker, RWrobel, JZhang, PZhang, ZZhu, Y New progesterone receptor antagonists: 3,3-disubstituted-5-aryloxindoles. Bioorg Med Chem Lett 12:3487-90 (2002)  
Target
Name:
Progesterone receptor
Synonyms:
NR3C3 PGR PRGR_HUMAN | progesterone
Type:
Protein
Mol. Mass.:
98979.52
Organism:
Homo sapiens (Human)
Description:
P06401
Residue:
933
  
Inhibitor
Name:
BDBM50121176
Synonyms:
3-(2'-oxo-1',2'-dihydrospiro[cyclopentane-1,3'-indol]-5'-yl)benzonitrile | CHEMBL117573
Type:
Small organic molecule
Emp. Form.:
C19H16N2O
Mol. Mass.:
288.3431
SMILES:
O=C1Nc2ccc(cc2C11CCCC1)-c1cccc(c1)C#N
: