Target
Progesterone receptor
Ligand
BDBM50121167
Substrate
Meas. Tech.
ChEMBL_159533 (CHEMBL767566)
IC50
14±n/a nM
Citation
 Fensome, ABender, RCohen, JCollins, MAMackner, VAMiller, LLUllrich, JWWinneker, RWrobel, JZhang, PZhang, ZZhu, Y New progesterone receptor antagonists: 3,3-disubstituted-5-aryloxindoles. Bioorg Med Chem Lett 12:3487-90 (2002)  
Target
Name:
Progesterone receptor
Synonyms:
NR3C3 PGR PRGR_HUMAN | progesterone
Type:
Protein
Mol. Mass.:
98979.52
Organism:
Homo sapiens (Human)
Description:
P06401
Residue:
933
  
Inhibitor
Name:
BDBM50121167
Synonyms:
5-fluoro-3-(2'-oxo-1',2'-dihydrospiro[cyclopentane-1,3'-indol]-5'-yl)benzonitrile | CHEMBL117461
Type:
Small organic molecule
Emp. Form.:
C19H15FN2O
Mol. Mass.:
306.3336
SMILES:
Fc1cc(cc(c1)-c1ccc2NC(=O)C3(CCCC3)c2c1)C#N
: