Target
Progesterone receptor
Ligand
BDBM50121178
Substrate
Meas. Tech.
ChEBML_159532
IC50
28±n/a nM
Citation
 Fensome, ABender, RCohen, JCollins, MAMackner, VAMiller, LLUllrich, JWWinneker, RWrobel, JZhang, PZhang, ZZhu, Y New progesterone receptor antagonists: 3,3-disubstituted-5-aryloxindoles. Bioorg Med Chem Lett 12:3487-90 (2002)  
Target
Name:
Progesterone receptor
Synonyms:
NR3C3 PGR PRGR_HUMAN | progesterone
Type:
Protein
Mol. Mass.:
98979.52
Organism:
Homo sapiens (Human)
Description:
P06401
Residue:
933
  
Inhibitor
Name:
BDBM50121178
Synonyms:
5-(3,3-Dimethyl-2-oxo-2,3-dihydro-1H-indol-5-yl)-thiophene-2-carbonitrile | CHEMBL117954
Type:
Small organic molecule
Emp. Form.:
C15H12N2OS
Mol. Mass.:
268.334
SMILES:
CC1(C)C(=O)Nc2ccc(cc12)-c1ccc(s1)C#N
: