Target
Progesterone receptor
Ligand
BDBM50121183
Substrate
Meas. Tech.
ChEBML_159532
IC50
29±n/a nM
Citation
 Fensome, ABender, RCohen, JCollins, MAMackner, VAMiller, LLUllrich, JWWinneker, RWrobel, JZhang, PZhang, ZZhu, Y New progesterone receptor antagonists: 3,3-disubstituted-5-aryloxindoles. Bioorg Med Chem Lett 12:3487-90 (2002)  
Target
Name:
Progesterone receptor
Synonyms:
NR3C3 PGR PRGR_HUMAN | progesterone
Type:
Protein
Mol. Mass.:
98979.52
Organism:
Homo sapiens (Human)
Description:
P06401
Residue:
933
  
Inhibitor
Name:
BDBM50121183
Synonyms:
5-(3-Chloro-5-fluoro-phenyl)-3,3-dimethyl-1,3-dihydro-indol-2-one | CHEMBL117067
Type:
Small organic molecule
Emp. Form.:
C16H13ClFNO
Mol. Mass.:
289.732
SMILES:
CC1(C)C(=O)Nc2ccc(cc12)-c1cc(F)cc(Cl)c1
: