Target
Progesterone receptor
Ligand
BDBM50121182
Substrate
Meas. Tech.
ChEBML_159532
IC50
206±n/a nM
Citation
 Fensome, ABender, RCohen, JCollins, MAMackner, VAMiller, LLUllrich, JWWinneker, RWrobel, JZhang, PZhang, ZZhu, Y New progesterone receptor antagonists: 3,3-disubstituted-5-aryloxindoles. Bioorg Med Chem Lett 12:3487-90 (2002)  
Target
Name:
Progesterone receptor
Synonyms:
NR3C3 PGR PRGR_HUMAN | progesterone
Type:
Protein
Mol. Mass.:
98979.52
Organism:
Homo sapiens (Human)
Description:
P06401
Residue:
933
  
Inhibitor
Name:
BDBM50121182
Synonyms:
5-(3-Acetyl-phenyl)-3,3-dimethyl-1,3-dihydro-indol-2-one | CHEMBL332502
Type:
Small organic molecule
Emp. Form.:
C18H17NO2
Mol. Mass.:
279.3331
SMILES:
CC(=O)c1cccc(c1)-c1ccc2NC(=O)C(C)(C)c2c1
: