Target
Progesterone receptor
Ligand
BDBM50121181
Substrate
Meas. Tech.
ChEBML_159532
IC50
130±n/a nM
Citation
 Fensome, ABender, RCohen, JCollins, MAMackner, VAMiller, LLUllrich, JWWinneker, RWrobel, JZhang, PZhang, ZZhu, Y New progesterone receptor antagonists: 3,3-disubstituted-5-aryloxindoles. Bioorg Med Chem Lett 12:3487-90 (2002)  
Target
Name:
Progesterone receptor
Synonyms:
NR3C3 PGR PRGR_HUMAN | progesterone
Type:
Protein
Mol. Mass.:
98979.52
Organism:
Homo sapiens (Human)
Description:
P06401
Residue:
933
  
Inhibitor
Name:
BDBM50121181
Synonyms:
5-(3-Chloro-phenyl)-3-ethyl-1,3-dihydro-indol-2-one | CHEMBL117624
Type:
Small organic molecule
Emp. Form.:
C16H14ClNO
Mol. Mass.:
271.741
SMILES:
CCC1C(=O)Nc2ccc(cc12)-c1cccc(Cl)c1
: