Target
E3 ubiquitin-protein ligase CBL-B
Ligand
BDBM50570684
Substrate
Meas. Tech.
ChEMBL_2112736 (CHEMBL4821586)
IC50
7840±n/a nM
Citation
 Hu, LBHu, XQZhang, QYou, QDJiang, ZY An affinity prediction approach for the ligand of E3 ligase Cbl-b and an insight into substrate binding pattern. Bioorg Med Chem 38:0 (2021)  
Target
Name:
E3 ubiquitin-protein ligase CBL-B
Synonyms:
2.3.2.27 CBLB_HUMAN RING finger protein 56 RNF56 Signal transduction protein CBL-B
Type:
PROTEIN
Mol. Mass.:
109467.65
Organism:
Homo sapiens
Description:
ChEMBL_120423
Residue:
982
  
Inhibitor
Name:
BDBM50570684
Synonyms:
CHEMBL4872230
Type:
Small organic molecule
Emp. Form.:
C30H43N6O13P
Mol. Mass.:
726.6686
SMILES:
C[C@@H](O)[C@H](NC(=O)[C@H](Cc1ccc(OP(O)(O)=O)cc1)NC(C)=O)C(=O)N1CCC[C@H]1C(=O)N[C@@H](CCC(O)=O)C(=O)N1CCC[C@H]1C(N)=O
: