Target
Mitogen-activated protein kinase 1
Ligand
BDBM418270
Substrate
Meas. Tech.
ChEMBL_2121006 (CHEMBL4830153)
IC50
1.8±n/a nM
Citation
 Heightman, TDBerdini, VBevan, LBuck, IMCarr, MGCourtin, ACoyle, JEDay, JEHEast, CFazal, LGriffiths-Jones, CMHoward, SKucia-Tran, JMartins, VMuench, SMunck, JMNorton, DO'Reilly, MPalmer, NPathuri, PPeakman, TMReader, MRees, DCRich, SJShah, AWallis, NGWalton, HWilsher, NEWoolford, AJCooke, MCousin, DOnions, SShannon, JWatts, JMurray, CW Discovery of ASTX029, A Clinical Candidate Which Modulates the Phosphorylation and Catalytic Activity of ERK1/2. J Med Chem 64:12286-12303 (2021)  
Target
Name:
Mitogen-activated protein kinase 1
Synonyms:
ERK2 Extracellular signal-regulated kinase 2 Extracellular signal-regulated kinase 2 (ERK2) MAPK 2 MK01_HUMAN Mitogen-activated protein kinase 1 (ERK-2) Mitogen-activated protein kinase 2 PRKM2 | p42-MAPK
Type:
Ser/Thr Protein Kinase
Mol. Mass.:
41392.76
Organism:
Homo sapiens (Human)
Description:
P28482
Residue:
360
  
Inhibitor
Name:
BDBM418270
Synonyms:
(2R)-2-(6-{5-chloro-2-[(oxan-4- yl)amino]pyrimidin-4-yl}-1-oxo-2,3- dihydro-1H-isoindol-2-yl)-N-[(1S)-1-[3- fluoro-5-(4-methylpiperazin-1- yl)phenyl]-2- hydroxyethyl]propanamide US11001575, Example 1054
Type:
Small organic molecule
Emp. Form.:
C33H39ClFN7O4
Mol. Mass.:
652.159
SMILES:
C[C@@H](N1Cc2ccc(cc2C1=O)-c1nc(NC2CCOCC2)ncc1Cl)C(=O)N[C@H](CO)c1cc(F)cc(c1)N1CCN(C)CC1
: