Target
Presenilin-1
Ligand
BDBM50577501
Substrate
Meas. Tech.
ChEMBL_2130375 (CHEMBL4839804)
EC50
10.0±n/a nM
Citation
 Bursavich, MGHarrison, BAAcharya, RCosta, DEFreeman, EAHrdlicka, LAJin, HKapadnis, SMoffit, JSMurphy, DNolan, SJPatzke, HTang, CVan Voorhies, HEWen, MKoenig, GBlain, JFBurnett, DA Discovery of the Oxadiazine FRM-024: A Potent CNS-Penetrant Gamma Secretase Modulator. J Med Chem 64:14426-14447 (2021)  
Target
Name:
Presenilin-1
Synonyms:
3.4.23.- Gamma-Secretase Subunit Presenilin-1 PS1 PSEN1 PSNL1 Presenilin-1 CTF12 Protein S182
Type:
Mol. Mass.:
52657.13
Organism:
Homo sapiens (Human)
Description:
P49768
Residue:
467
  
Inhibitor
Name:
BDBM50577501
Synonyms:
CHEMBL4851690
Type:
Small organic molecule
Emp. Form.:
C23H27N5O2
Mol. Mass.:
405.4928
SMILES:
COc1nc(ccc1-n1cnc(C)c1)C1=NOCC(N1)c1ccc(cc1)C(C)(C)C
: