Target
Mitogen-activated protein kinase 8
Ligand
BDBM50578351
Substrate
Meas. Tech.
ChEMBL_2132756 (CHEMBL4842271)
IC50
170±n/a nM
Citation
 Nagy, MAHilgraf, RMortensen, DSElsner, JNorris, STikhe, JYoon, WPaisner, DDelgado, MErdman, PHaelewyn, JKhambatta, GXu, LRomanow, WJCondroski, KBahmanyar, SMcCarrick, MBenish, BBlease, KLeBrun, LMoghaddam, MFApuy, JCanan, SSBennett, BLSatoh, Y Discovery of the c-Jun N-Terminal Kinase Inhibitor  J Med Chem 64:18193-18208 (2021)  
Target
Name:
Mitogen-activated protein kinase 8
Synonyms:
Jnk1 MAPK 8 Mapk8 Stress-activated protein kinase JNK1 | c-Jun N-terminal kinase 1
Type:
PROTEIN
Mol. Mass.:
44234.80
Organism:
Mus musculus
Description:
ChEMBL_120521
Residue:
384
  
Inhibitor
Name:
BDBM50578351
Synonyms:
CHEMBL4862452
Type:
Small organic molecule
Emp. Form.:
C16H23N5O2
Mol. Mass.:
317.3861
SMILES:
NC(=O)c1cnc(N[C@H]2CC[C@H](O)CC2)nc1NC12CC(C1)C2
: