Target
Corticotropin-releasing factor receptor 1
Ligand
BDBM50071235
Substrate
Meas. Tech.
ChEMBL_303525 (CHEMBL839639)
Ki
1.6±n/a nM
Citation
 Chen, CWilcoxen, KMHuang, CQXie, YFMcCarthy, JRWebb, TRZhu, YFSaunders, JLiu, XJChen, TKBozigian, HGrigoriadis, DE Design of 2,5-dimethyl-3-(6-dimethyl-4-methylpyridin-3-yl)-7-dipropylaminopyrazolo[1,5-a]pyrimidine (NBI 30775/R121919) and structure--activity relationships of a series of potent and orally active corticotropin-releasing factor receptor antagonists. J Med Chem 47:4787-98 (2004)  
Target
Name:
Corticotropin-releasing factor receptor 1
Synonyms:
CRF-R CRF1 CRFR1 CRH-R 1 CRHR1 Corticotropin-releasing factor receptor 1 (CRF-1) Corticotropin-releasing hormone receptor 1
Type:
Enzyme
Mol. Mass.:
50744.31
Organism:
Homo sapiens (Human)
Description:
P34998
Residue:
444
  
Inhibitor
Name:
BDBM50071235
Synonyms:
CHEMBL65078 Cyclopropylmethyl-[3-(2,4-dichloro-phenyl)-2,5-dimethyl-pyrazolo[1,5-a]pyrimidin-7-yl]-propyl-amine
Type:
Small organic molecule
Emp. Form.:
C21H24Cl2N4
Mol. Mass.:
403.348
SMILES:
CCCN(CC1CC1)c1cc(C)nc2c(c(C)nn12)-c1ccc(Cl)cc1Cl
: