Target
ATPase family AAA domain-containing protein 2
Ligand
BDBM50584946
Substrate
Meas. Tech.
ChEMBL_2160909 (CHEMBL5045659)
IC50
501±n/a nM
Citation
 Winter-Holt, JJBardelle, CChiarparin, EDale, ILDavey, PRJDavies, NLDenz, CFillery, SMGuérot, CMHan, FHughes, SJKulkarni, MLiu, ZMilbradt, AMoss, TANiu, HPatel, JRabow, AASchimpl, MShi, JSun, DYang, DGuichard, S Discovery of a Potent and Selective ATAD2 Bromodomain Inhibitor with Antiproliferative Activity in Breast Cancer Models. J Med Chem 65:3306-3331 (2022)  
Target
Name:
ATPase family AAA domain-containing protein 2
Synonyms:
AAA nuclear coregulator cancer-associated protein ATAD2 PRO2000
Type:
PROTEIN
Mol. Mass.:
158546.30
Organism:
Homo sapiens (Human)
Description:
ChEMBL_1500426
Residue:
1390
  
Inhibitor
Name:
BDBM50584946
Synonyms:
CHEMBL5090369
Type:
Small organic molecule
Emp. Form.:
C29H36F2N8O2
Mol. Mass.:
566.6453
SMILES:
[H][C@]12Cc3ccccc3[C@]([H])([C@H](NC1=O)C(C)C)N2C(=O)c1cc(NC2CCN(CC(C)(F)F)CC2)c2nnc(C)n2n1
: