Target
Bromodomain testis-specific protein
Ligand
BDBM50584925
Substrate
Meas. Tech.
ChEMBL_2160947 (CHEMBL5045697)
Kd
200±n/a nM
Citation
 Winter-Holt, JJBardelle, CChiarparin, EDale, ILDavey, PRJDavies, NLDenz, CFillery, SMGuérot, CMHan, FHughes, SJKulkarni, MLiu, ZMilbradt, AMoss, TANiu, HPatel, JRabow, AASchimpl, MShi, JSun, DYang, DGuichard, S Discovery of a Potent and Selective ATAD2 Bromodomain Inhibitor with Antiproliferative Activity in Breast Cancer Models. J Med Chem 65:3306-3331 (2022)  
Target
Name:
Bromodomain testis-specific protein
Synonyms:
BRDT Bromodomain and extra-terminal motif (BET) Cancer/testis antigen 9 | RING3-like protein
Type:
PROTEIN
Mol. Mass.:
107982.01
Organism:
Homo sapiens (Human)
Description:
ChEMBL_1502985
Residue:
947
  
Inhibitor
Name:
BDBM50584925
Synonyms:
CHEMBL5079885
Type:
Small organic molecule
Emp. Form.:
C30H39FN8O2
Mol. Mass.:
562.6815
SMILES:
[H][C@]12Cc3ccccc3[C@]([H])([C@H](NC1=O)C(C)C)N2C(=O)c1cc(NC2CCN(CC(C)(C)F)CC2)c2nnc(C)n2n1
: