Target
Cytochrome P450 2D6
Ligand
BDBM50450813
Substrate
Meas. Tech.
ChEMBL_2171278 (CHEMBL5056412)
IC50
>50000±n/a nM
Citation
 Pribut, ND'Erasmo, MDasari, MGiesler, KEIskandar, SSharma, SKBartsch, PWRaghuram, ABushnev, AHwang, SSBurton, SLDerdeyn, CABasson, AELiotta, DCMiller, EJ ?-Functionalized Lipid Prodrugs of HIV NtRTI Tenofovir with Enhanced Pharmacokinetic Properties. J Med Chem 64:12917-12937 (2021)  
Target
Name:
Cytochrome P450 2D6
Synonyms:
CP2D6_HUMAN CYP2DL1 Cytochrome P450 2D6 (CYP2D6) P450-DB1
Type:
Protein
Mol. Mass.:
55774.82
Organism:
Homo sapiens (Human)
Description:
P10635
Residue:
497
  
Inhibitor
Name:
BDBM50450813
Synonyms:
Atripla GS-1275 Tenofovir | Truvada
Type:
Small organic molecule
Emp. Form.:
C9H14N5O4P
Mol. Mass.:
287.2123
SMILES:
C[C@H](Cn1cnc2c(N)ncnc12)OCP(O)(O)=O
: