Target
Cytochrome P450 2D6
Ligand
BDBM50587163
Substrate
Meas. Tech.
ChEMBL_2171278 (CHEMBL5056412)
IC50
21700±n/a nM
Citation
 Pribut, ND'Erasmo, MDasari, MGiesler, KEIskandar, SSharma, SKBartsch, PWRaghuram, ABushnev, AHwang, SSBurton, SLDerdeyn, CABasson, AELiotta, DCMiller, EJ ?-Functionalized Lipid Prodrugs of HIV NtRTI Tenofovir with Enhanced Pharmacokinetic Properties. J Med Chem 64:12917-12937 (2021)  
Target
Name:
Cytochrome P450 2D6
Synonyms:
CP2D6_HUMAN CYP2DL1 Cytochrome P450 2D6 (CYP2D6) P450-DB1
Type:
Protein
Mol. Mass.:
55774.82
Organism:
Homo sapiens (Human)
Description:
P10635
Residue:
497
  
Inhibitor
Name:
BDBM50587163
Synonyms:
CHEMBL5084257
Type:
Small organic molecule
Emp. Form.:
C29H55N6O5PSi
Mol. Mass.:
626.8435
SMILES:
[#7].[#6]-[#6@H](-[#6]-n1cnc2c(-[#7])ncnc12)-[#8]-[#6]P([#8])(=O)[#8]-[#6]-[#6]-[#6]-[#8]-[#6]-[#6]-[#6]-[#6]-[#6]-[#6]-[#6]-[#6]-[#6]-[#6]-[#6]-[#6]C#C[Si;v4]([#6])([#6])[#6]
: