Target
Diacylglycerol O-acyltransferase 2
Ligand
BDBM276754
Substrate
Meas. Tech.
ChEMBL_2187623 (CHEMBL5099705)
IC50
196±n/a nM
Citation
 Futatsugi, KCabral, SKung, DWHuard, KLee, EBoehm, MBauman, JClark, RWCoffey, SBCrowley, CDechert-Schmitt, AMDowling, MSDullea, RGosset, JRKalgutkar, ASKou, KLi, QLian, YLoria, PMLondregan, ATNiosi, MOrozco, CPettersen, JCPfefferkorn, JAPolivkova, JRoss, TTSharma, RStock, IATesz, GWisniewska, HGoodwin, BPrice, DA Discovery of Ervogastat (PF-06865571): A Potent and Selective Inhibitor of Diacylglycerol Acyltransferase 2 for the Treatment of Non-alcoholic Steatohepatitis. J Med Chem 65:15000-15013 (2022) Target
Name:
Diacylglycerol O-acyltransferase 2
Synonyms:
ARAT DGAT2 Diacylglycerol O-acyltransferase 2 (DGAT2) Retinol O-fatty-acyltransferase
Type:
Multi-pass membrane protein
Mol. Mass.:
43848.90
Organism:
Homo sapiens (Human)
Description:
Q96PD7
Residue:
388
  
Inhibitor
Name:
BDBM276754
Synonyms:
N-(1,1-dioxidotetrahydro- thiophen-3-yl)-2-(5-((3- ethoxypyridin-2-yl)oxy) pyridin-3-yl)pyrimidine- 5-carboxamide US11034678, Example 3.3 WO2018033832, Ex. 3.3
Type:
Small organic molecule
Emp. Form.:
C21H21N5O5S
Mol. Mass.:
455.487
SMILES:
CCOc1cccnc1Oc1cncc(c1)-c1ncc(cn1)C(=O)NC1CCS(=O)(=O)C1
: