Target
Cannabinoid receptor 1
Ligand
BDBM50160428
Substrate
Meas. Tech.
ChEMBL_302577 (CHEMBL839538)
Ki
1779±n/a nM
Citation
 Lavey, BJKozlowski, JAHipkin, RWGonsiorek, WLundell, DJPiwinski, JJNarula, SLunn, CA Triaryl bis-sulfones as a new class of cannabinoid CB2 receptor inhibitors: identification of a lead and initial SAR studies. Bioorg Med Chem Lett 15:783-6 (2005)  
Target
Name:
Cannabinoid receptor 1
Synonyms:
CANN6 CB-R CNR CNR1_HUMAN Cannabinoid receptor Cannabinoid receptor 1 (brain)
Type:
G Protein-Coupled Receptor (GPCR)
Mol. Mass.:
52868.96
Organism:
Homo sapiens (Human)
Description:
P21554
Residue:
472
  
Inhibitor
Name:
BDBM50160428
Synonyms:
CHEMBL359712 | N-((S)-1-{4-[4-Methoxy-2-(4-methoxy-benzenesulfonyl)-benzenesulfonyl]-phenyl}-ethyl)-acetamide
Type:
Small organic molecule
Emp. Form.:
C24H25NO7S2
Mol. Mass.:
503.588
SMILES:
COc1ccc(cc1)S(=O)(=O)c1cc(OC)ccc1S(=O)(=O)c1ccc(cc1)[C@H](C)NC(C)=O
: