Target
REST corepressor 1
Ligand
BDBM50507295
Substrate
Meas. Tech.
ChEMBL_2210854 (CHEMBL5123803)
Kd
243±n/a nM
Citation
 Menna, MFiorentino, FMarrocco, BLucidi, ATomassi, SCilli, DRomanenghi, MCassandri, MPomella, SPezzella, MDel Bufalo, DZeya Ansari, MSToma?evi?, NMladenovi?, MViviano, MSbardella, GRota, RTrisciuoglio, DMinucci, SMattevi, ARotili, DMai, A Novel non-covalent LSD1 inhibitors endowed with anticancer effects in leukemia and solid tumor cellular models. Eur J Med Chem 237:0 (2022) Target
Name:
REST corepressor 1
Synonyms:
KIAA0071 RCOR RCOR1_HUMAN | REST corepressor 1
Type:
PROTEIN
Mol. Mass.:
53329.34
Organism:
Homo sapiens (Human)
Description:
ChEMBL_108118
Residue:
485
  
Inhibitor
Name:
BDBM50507295
Synonyms:
CHEMBL1232432
Type:
Small organic molecule
Emp. Form.:
C27H38N6O2
Mol. Mass.:
478.6296
SMILES:
COc1cc2nc(NCCCN(C)C)nc(NC3CCN(Cc4ccccc4)CC3)c2cc1OC
: