Target
Histone-lysine N-methyltransferase EHMT2
Ligand
BDBM50507295
Substrate
Meas. Tech.
ChEMBL_2210856 (CHEMBL5123805)
Ki
680±n/a nM
Citation
 Menna, MFiorentino, FMarrocco, BLucidi, ATomassi, SCilli, DRomanenghi, MCassandri, MPomella, SPezzella, MDel Bufalo, DZeya Ansari, MSToma?evi?, NMladenovi?, MViviano, MSbardella, GRota, RTrisciuoglio, DMinucci, SMattevi, ARotili, DMai, A Novel non-covalent LSD1 inhibitors endowed with anticancer effects in leukemia and solid tumor cellular models. Eur J Med Chem 237:0 (2022) Target
Name:
Histone-lysine N-methyltransferase EHMT2
Synonyms:
BAT8 EHMT2 G9A Histone-lysine N-methyltransferase EHMT1/EHMT2 KMT1C Protein G9a (G9a)
Type:
Enzyme
Mol. Mass.:
132339.87
Organism:
Homo sapiens (Human)
Description:
Q96KQ7
Residue:
1210
  
Inhibitor
Name:
BDBM50507295
Synonyms:
CHEMBL1232432
Type:
Small organic molecule
Emp. Form.:
C27H38N6O2
Mol. Mass.:
478.6296
SMILES:
COc1cc2nc(NCCCN(C)C)nc(NC3CCN(Cc4ccccc4)CC3)c2cc1OC
: