Target
Histone-lysine N-methyltransferase, H3 lysine-79 specific
Ligand
BDBM50009672
Substrate
Meas. Tech.
ChEMBL_2210858 (CHEMBL5123807)
IC50
140±n/a nM
Citation
 Menna, MFiorentino, FMarrocco, BLucidi, ATomassi, SCilli, DRomanenghi, MCassandri, MPomella, SPezzella, MDel Bufalo, DZeya Ansari, MSToma?evi?, NMladenovi?, MViviano, MSbardella, GRota, RTrisciuoglio, DMinucci, SMattevi, ARotili, DMai, A Novel non-covalent LSD1 inhibitors endowed with anticancer effects in leukemia and solid tumor cellular models. Eur J Med Chem 237:0 (2022) Target
Name:
Histone-lysine N-methyltransferase, H3 lysine-79 specific
Synonyms:
2.1.1.43 DOT1-like protein (Dot1L) DOT1L_HUMAN Histone H3-K79 methyltransferase Histone Methyltransferase DOT1L KIAA1814 Lysine N-methyltransferase 4
Type:
Protein
Mol. Mass.:
184911.91
Organism:
Homo sapiens (Human)
Description:
Q8TEK3
Residue:
1537
  
Inhibitor
Name:
BDBM50009672
Synonyms:
AdoHcy S-(5'-adenosyl)-L-homocysteine S-[1-(adenin-9-yl)-1,5-dideoxy-beta-D-ribofuranos-5-yl]-L-homocysteine SAH US9175331, 1 | US9333217, S-Adenosyl-L-homocysteine (SAH)
Type:
Small organic molecule
Emp. Form.:
C14H20N6O5S
Mol. Mass.:
384.411
SMILES:
N[C@@H](CCSC[C@H]1O[C@H]([C@H](O)[C@@H]1O)n1cnc2c(N)ncnc12)C(O)=O
: