Target
Protein arginine N-methyltransferase 1
Ligand
BDBM50009672
Substrate
Meas. Tech.
ChEMBL_2210864 (CHEMBL5123813)
IC50
250±n/a nM
Citation
 Menna, MFiorentino, FMarrocco, BLucidi, ATomassi, SCilli, DRomanenghi, MCassandri, MPomella, SPezzella, MDel Bufalo, DZeya Ansari, MSToma?evi?, NMladenovi?, MViviano, MSbardella, GRota, RTrisciuoglio, DMinucci, SMattevi, ARotili, DMai, A Novel non-covalent LSD1 inhibitors endowed with anticancer effects in leukemia and solid tumor cellular models. Eur J Med Chem 237:0 (2022) Target
Name:
Protein arginine N-methyltransferase 1
Synonyms:
2.1.1.319 HMT2 HRMT1L2 {ECO:0000303|PubMed:11097842 IR1B4 PRMT1 Protein-arginine N-methyltransferase 1 | Synonyms=HMT2
Type:
PROTEIN
Mol. Mass.:
42451.61
Organism:
Homo sapiens
Description:
ChEMBL_100878
Residue:
371
  
Inhibitor
Name:
BDBM50009672
Synonyms:
AdoHcy S-(5'-adenosyl)-L-homocysteine S-[1-(adenin-9-yl)-1,5-dideoxy-beta-D-ribofuranos-5-yl]-L-homocysteine SAH US9175331, 1 | US9333217, S-Adenosyl-L-homocysteine (SAH)
Type:
Small organic molecule
Emp. Form.:
C14H20N6O5S
Mol. Mass.:
384.411
SMILES:
N[C@@H](CCSC[C@H]1O[C@H]([C@H](O)[C@@H]1O)n1cnc2c(N)ncnc12)C(O)=O
: