Target
Coagulation factor X
Ligand
BDBM50172211
Substrate
Meas. Tech.
ChEMBL_321215 (CHEMBL884634)
IC50
3300±n/a nM
Citation
 Kohrt, JTFilipski, KJCody, WLCai, CDudley, DAVan Huis, CAWillardsen, JARapundalo, STSaiya-Cork, KLeadley, RJNarasimhan, LZhang, EWhitlow, MAdler, MMcLean, KChou, YLMcKnight, CArnaiz, DOShaw, KJLight, DREdmunds, JJ The discovery of fluoropyridine-based inhibitors of the Factor VIIa/TF complex. Bioorg Med Chem Lett 15:4752-6 (2005)  
Target
Name:
Coagulation factor X
Synonyms:
Activated coagulation factor X (FXa) Coagulation factor X precursor F10 Factor X heavy chain Factor Xa Stuart-Prower factor
Type:
Enzyme
Mol. Mass.:
54726.60
Organism:
Homo sapiens (Human)
Description:
Residue:
488
  
Inhibitor
Name:
BDBM50172211
Synonyms:
5-tert-Butyl-2-[6-(3-carbamimidoyl-phenoxy)-3,5-difluoro-4-(1-methyl-3-phenyl-propylamino)-pyridin-2-yloxy]-benzoic acid; TFA | CHEMBL373185
Type:
Small organic molecule
Emp. Form.:
C33H34F2N4O4
Mol. Mass.:
588.6443
SMILES:
CC(CCc1ccccc1)Nc1c(F)c(Oc2cccc(c2)C(N)=N)nc(Oc2ccc(cc2C(O)=O)C(C)(C)C)c1F
: